{"text_format":"1","workbook":"xlsx","n_sheets":7,"sheets":["Bienvenue","Sommaire","Formulaire","Declaration","Nomenclature","Exemples","Specs"],"not_rendered":{"charts":0,"images":51,"macros":1,"external_links":0,"defined_names":127,"comments":0,"pivot_tables":0},"unopened":[],"bounds":{"document_bytes":16777216,"sheet_cells":100000,"rows_first":2000,"rows_last":500,"rows_between":2000,"halvings":0,"cell_chars":16384,"cell_head_chars":4096},"cells_cut":0,"cells_raw":0,"read":"whole","date_system":"1900"}

{"sheet":"Bienvenue","index":0,"n_rows":314,"n_cols":11,"rows_kept":314,"cut":false,"hidden":false,"merged":[[9,1,10,1],[9,10,10,13]]}
[]
[null,"Nous vous souhaitons la bienvenue sur la Déclaration détaillée"]
[]
[null,"Pour utiliser convenablement le fichier et bénéficier de ses fonctionnalités, il est nécessaire d'activer les macros."]
[]
[null,"Mes macros sont-elles bien activées ?"]
[]
[]
[]
[null,"Oui",null,null,null,"Non / Je ne sais pas. ",null,null,null,null,{"$f":"HYPERLINK( \"#\" & IF(TEXT(INFO(\"VERSION\"),0)=\"14\",\"Macro_2010\",IF(INFO(\"VERSION\")=\"12.0\",\"Macro_2007\",\"Macro_2003\")),\"Cheminement pour activer les macros\")","v":"Cheminement pour activer les macros"}]
[null,null,null,null,null,"J'active mes macros en suivant la procédure"]
[null,null,null,null,""]
[]
[]
[]
{"$rows_left_out":300}
{"sheet":"Sommaire","index":1,"n_rows":44,"n_cols":17,"rows_kept":44,"cut":false,"hidden":false,"merged":[[1,5,1,7],[3,3,3,4],[5,3,5,5],[42,8,42,10],[16,5,16,7],[20,5,20,7],[40,1,40,9],[18,5,18,7]]}
[null,null,null,null,null,"Contactez nos conseillers au 0 810 00 86 90",null,null,null,{"$f":"\"Déclaration \"&WWANNEE","v":"Déclaration 2015"}]
[null,null,null,null,null,"Sommaire"]
[null,null,null,null,null,null,null,null,null,null,"* Champ obligatoire à remplir"]
[null,null,"N° d'adhérent *","A2100138"]
[]
[null,null,"Nom d'adhérent *","SA. DOMAINE GROS A.F."]
[null,null,null,null,null,null,null,null,null,null,null,null,null,null,null,"Premiere Accès onglet Déclaration :",0]
["Remplir votre déclaration",null,null,null,null,null,null,null,null,null,null,null,null,null,null,"WbkLivraison",1]
[]
["1 - ",null,"Remplir votre déclaration",null,null,null,null,null,null,null,null,null,null,null,null,null,false]
[null,null,null,null,null,null,null,null,null,{"$f":"\"Accéder à la Déclaration \"&WWANNEE","v":"Accéder à la Déclaration 2015"},2015]
["Vous avez terminé de remplir votre déclaration ?"]
["2 - ",null,"Renseigner ou vérifier vos informations sur l'entreprise"]
[]
["3 -",null,"Contrôler et certifier la conformité des données renseignées"]
{"$rows_left_out":30}
{"sheet":"Formulaire","index":2,"n_rows":107,"n_cols":27,"rows_kept":107,"cut":false,"hidden":false,"merged":[[57,8,57,9],[59,3,59,7],[60,10,60,12],[57,10,57,12],[58,10,58,12],[108,0,108,6],[108,8,108,15],[102,8,102,9],[102,10,102,12],[95,8,95,15],[102,0,102,2],[102,3,102,7],[95,0,95,6],[92,8,92,15],[94,8,94,15],[93,8,93,15],[83,8,83,15],[84,8,84,15],[85,8,85,15],[88,8,88,15],[89,8,89,15],[91,8,91,15],[90,8,90,15],[82,0,82,6],[74,0,74,6],[78,0,78,6],[79,0,79,6],[72,0,72,6],[77,0,77,6],[81,0,81,6],[75,0,75,6],[73,0,73,6],[76,0,76,6],[87,8,87,15],[80,8,80,15],[83,0,83,6],[86,8,86,15],[84,0,84,6],[85,0,85,6],[86,0,86,6],[88,0,88,6],[89,0,89,6],[87,0,87,6],[76,8,76,15],[75,8,75,15],[52,3,52,7],[52,0,52,2],[54,8,54,9],[59,8,59,9],[56,8,56,9],[51,0,51,2],[51,3,51,7],[79,8,79,15],[73,8,73,15],[64,0,64,2],[78,8,78,15],[65,3,65,7],[65,0,65,2],[74,8,74,15],[77,8,77,15],[72,8,72,15],[56,0,56,2],[57,0,57,2],[62,3,62,7],[59,0,59,2],[71,0,71,6],[62,10,62,12],[71,8,71,15],[62,0,62,2],[65,8,65,9],[65,10,65,12],[56,3,56,7],[60,8,60,9],[62,8,62,9],[61,0,61,2],[53,8,53,9],[55,10,55,12],[55,0,55,2],[53,3,53,7],[55,3,55,7],[54,0,54,2],[61,10,61,12],[53,0,53,2],[64,8,64,9],[61,3,61,7],[64,3,64,7],[63,3,63,7],[54,3,54,7],[57,3,57,7],[60,3,60,7],[64,10,64,12],[61,8,61,9],[63,10,63,12],[41,0,41,2],[45,3,45,7],[47,0,47,2],[42,0,42,2],[45,0,45,2],[43,0,43,2],[46,0,46,2],[33,3,33,6],[35,3,35,11],[42,8,42,9],[42,3,42,7],[46,3,46,7],[44,3,44,7],[41,10,41,12],[47,10,47,12],[47,3,47,7],[43,3,43,7],[42,10,42,12],[45,10,45,12],[43,8,43,9],[44,10,44,12],[41,3,41,7],[41,8,41,9],[31,3,31,11],[25,6,25,11],[27,9,27,11],[14,3,14,6],[14,7,14,14],[21,3,21,11],[4,6,4,12],[8,3,8,11],[19,3,19,11],[23,3,23,11],[29,3,29,11],[10,3,10,6],[12,3,12,6],[12,7,12,13],[27,3,27,6],[49,10,49,12],[49,8,49,9],[48,10,48,12],[43,10,43,12],[56,10,56,12],[55,8,55,9],[51,10,51,12],[53,10,53,12],[45,8,45,9],[47,8,47,9],[46,8,46,9],[46,10,46,12],[44,8,44,9],[52,8,52,9],[54,10,54,12],[52,10,52,12],[50,8,50,9],[50,10,50,12],[49,3,49,7],[44,0,44,2],[48,0,48,2],[90,0,90,6],[91,0,91,6],[92,0,92,6],[93,0,93,6],[94,0,94,6],[63,8,63,9],[63,0,63,2],[82,8,82,15],[81,8,81,15],[80,0,80,6],[48,3,48,7],[49,0,49,2],[51,8,51,9],[48,8,48,9],[50,0,50,2],[50,3,50,7],[58,0,58,2],[58,3,58,7],[59,10,59,12],[58,8,58,9],[60,0,60,2]]}
[null,null,null,null,null,null,null,null,null,null,null,null,null,null,null,{"$f":"Sommaire!J1","v":"Déclaration 2015"}]
[]
[]
[]
[null,null,null,null,null,null,"Informations sur l'entreprise"]
[null,null,null,null,null,null,null,null,null,null,null,null,null,null,null,"* Champ obligatoire à remplir"]
[null,null,null,"Informations générales"]
[]
[null,null,"Nom de l'entreprise :",{"$f":"IF(Sommaire!$D$6=\"\",\"\",Sommaire!$D$6)","v":""}]
[]
[null,null,"N° de SIRET * : ",null,null,null,null,"Indiquez votre N° de Siret à 14 chiffres si l'entreprise adhérente est immatriculée en France"]
[]
[null,null,"Chiffre d'Affaires en HT (€) : ",null,null,null,null,{"$f":"\"Indiquez votre chiffre d’affaires concerné pour l’année \"&WWANNEE","v":"Indiquez votre chiffre d’affaires concerné pour l’année 2015"}]
[]
[null,null,"Nombre d'UVC * :",4113,null,null,null,{"$f":"\"Indiquez le nombre d'Unités de Vente Consommateurs mises en marché en \"&WWANNEE","v":"Indiquez le nombre d'Unités de Vente Consommateurs mises en marché en 2015"}]
{"$rows_left_out":93}
{"sheet":"Declaration","index":3,"n_rows":119,"n_cols":59,"rows_kept":119,"cut":false,"hidden":false,"merged":[[1,52,1,53],[1,54,1,56],[2,6,2,7],[1,8,1,9]]}
[null,{"$f":"\"Déclaration détaillée \"&WWANNEE","v":"Déclaration détaillée 2015"},null,null,null,null,null,null,null,null,null,null,null,null,null,null,null,null,null,null,null,null,null,null,null,null,null,null,null,null,null,null,null,null,null,null,null,null,null,null,null,null,null,null,null,null,"AU","AV","AW","AX","AY","AZ"]
[null,"Calculer le montant de votre déclaration et\n contrôler vos données","Type d'emballage",null,null,null,null,null,"Composition par matériau",null,null,null,null,null,null,null,null,null,null,"Malus",null,null,"Bonus",null,null,"Emballages mis en marché",null,null,null,null,null,{"$f":"\"Total de votre déclaration \"&WWANNEE","v":"Total de votre déclaration 2015"},null,null,{"$f":"IF(OR(SUM($AW10:$AW10)<>0,SUM($AZ10:$AZ10)<>0),\"-\",SUM($AI10:$AI10))","v":0},null,1,null,null,null,null,null,null,null,null,46,47,48,49,50,51,52,"MAJORITAIRE",null,"NON MAJORITAIRE"]
["N° UVC ou \nréférence produit\n(Maximum 20 caractères)"," Libellé\n(Maximum 50 caractères\net doit contenir au moins une lettre)","Code produit","Libellé code produit","Code emballage","Libellé code emballage","\nQue contient l'emballage ?",null,"Code du \n1er matériau","Libellé du 1er matériau","Poids unitaire\n(en g) du 1er matériau \nou poids total de l'unité d'emballage\nsi un matériau est majoritaire à + 80%","Code du \n2nd matériau","Libellé du 2nd matériau","Poids unitaire\n(en g) \ndu 2nd matériau ","     Code du 3ème matériau","Libellé du \n3ème matériau","Poids unitaire\n(en g) du\n3ème matériau et\nmatériaux restants ","Poids total de\nl'unité d'emballage\n(en g)","  Votre emballage en papier-carton  contient-il plus de 50% de fibres recyclées ?","Votre emballage\nest-il perturbateur ?","Votre emballage\nest-il non-valorisable ?","Votre emballage\nest-il dans les consignes de tri \nmais sans filière de recyclage ?","Votre emballage\na-t-il fait l’objet d’une action de réduction à la source ?\nSi oui, laquelle ?","Votre emballage\na-t-il fait l'objet d'une action de sensibilisation ?  Si oui, laquelle ?","% des volumes ménagers\nconcernés par l'action de sensibilisation","Nombre d'emballages ménagers mis sur le marché","\n\nNombre d'emballages non ménagers ayant le même conditionnement que les produits ménagers mis sur le marché français","\n\nVos emballages non ménagers sont-ils des emballages de produits retournés, cassés ou périmés ?","\n\nVos emballages non ménagers sont-ils des films/cartons de regroupement qui ont été laissés sur le point de vente (délotage) avant le passage en caisse ?","\n\nVos emballages non ménagers sont-ils utilisés ou consommés par des professionnels et distribués dans des circuits mixtes ou réservés exclusivement aux professionnels\n(ex. : grossiste, cash & carry…) ?","\n\nVos emballages non ménagers sont-ils consommés ou utilisés au sein d’un établissement de restauration collective ou traditionnelle ?","Contribution \nau poids\n (ct euro)","Contribution\nà l'emballage\n(ct euro)","Contribution \nunitaire totale\n(ct euro)","Contribution totale \npar ligne \n(euro)",null,"Label control\n(logic)",null,null,null,null,null,null,null,null,"Renversement des Résultats de Test","CNB _ NB_erreurs","CNB _ NB_erreurs","CNB _ NB_erreurs","CB _ NB_erreurs","CB _ NB_erreurs","CB _ NB_erreurs","Contribution au poids Majoritaire","Contribution au\npoids Majoritaire\n(après décote)","Contribution au\npoids Non Majoritaire\n (après décote)\n - Matériau 1","Contribution au\npoids Non Majoritaire\n (après décote)\n - Matériau 2","Contribution au\npoids Non Majoritaire\n (après décote)\n - Matériau 3","Ctu Après Malus","Ctu Après Réduction Source"]
[1,"Exemple : Vin blanc 2010","023400","Vins","017","Bouteille",75,"cl",50,"Verre",436,null,"",null,null,"",null,436,"Non","Non","Non","Non","Réduction de poids","On-Pack ITPV",0.75,320000,75000,"Non","Non","Non","Oui",null,null,null,null,null,null,null,null,null,null,null,null,null,null,"(CB & CNB)",1,"Coloriage",1,1,1,1]
[1,"Exemple : Vin blanc 2010","023400","Vins","B10","Bouchon",1,"autre",60,"Autres matériaux",4.5,null,"",null,null,"",null,4.5,"Non","Non","Non","Non",null,"On-Pack ITPV",0.75,320000,75000,"Non","Non","Non","Oui"]
[1,"Exemple : Vin blanc 2010","023400","Vins","044","Etui souple",1,"autre",30,"Papier-carton - Autre que briques",85,null,"",null,null,"",null,85,"Non","Non","Non","Non",null,"On-Pack ITPV",0.75,320000,75000,"Non","Non","Non","Oui"]
[2,"Exemple : Comprimés x 20","096731","Allergologie","012","Boîte",2,"autre",30,"Papier-carton - Autre que briques",4.87,null,"",null,null,"",null,4.87,"Non","Non","Non","Non",null,null,null,542000,300000,"Non","Non","Oui","Non"]
[2,"Exemple : Comprimés x 20","096731","Allergologie","008","Blister à coque thermoformée, avec ou sans chevalet carton",10,"autre",43,"Plastique - Autres emballages plastique",3.429,20,"Aluminium",0.921,null,"",null,5.271,"Non","Non","Non","Non",null,null,null,1084000,600000,"Non","Non","Oui","Non",null,null,null,null,null,null,null,null,null,null,null,null,null,null,null,1,null,1,1,1,1]
["Filtre","Filtre","Filtre","Filtre","Filtre","Filtre","Filtre","Filtre","Filtre","Filtre","Filtre","Filtre","Filtre","Filtre","Filtre","Filtre","Filtre","Filtre","Filtre","Filtre","Filtre","Filtre","Filtre","Filtre","Filtre","Filtre","Filtre","Filtre","Filtre","Filtre","Filtre","Filtre","Filtre","Filtre","Filtre",null,"Filtre",null,null,null,null,null,null,null,null,null,1,null,1,1,1,1]
["1","vins 2014","023400",{"$f":"IF(ISBLANK(C10),\"\",IF(ISERROR(VLOOKUP(TEXT(C10,\"000000\"),Produits,2,FALSE)),IF(ISERROR(VLOOKUP(\"0\"&C10,Produits,2,FALSE)),\"N'appartient pas à la liste\",VLOOKUP(\"0\"&C10,Produits,2,FALSE)),VLOOKUP(TEXT(C10,\"000000\"),Produits,2,FALSE)))","v":""},"017",{"$f":"IF(ISBLANK(E10),\"\",IF(ISERROR(VLOOKUP(TEXT(E10,\"000\"),Emballages,2,0)),IF(ISERROR(VLOOKUP(\"0\"&E10,Emballages,2,FALSE)),\"N'appartient pas à la liste\",VLOOKUP(\"0\"&E10,Emballages,2,FALSE)),VLOOKUP(TEXT(E10,\"000\"),Emballages,2,0)))","v":""},75,"cl",50,{"$f":"IF(ISBLANK(I10),\"\",IF(ISERROR(VLOOKUP(I10,Bareme,2,FALSE)),\"N'appartient pas à la liste\",VLOOKUP(I10,Bareme,2,FALSE)))","v":""},550,null,{"$f":"IF(ISBLANK(L10),\"\",IF(ISERROR(VLOOKUP(L10,Bareme,2,FALSE)),\"N'appartient pas à la liste\",VLOOKUP(L10,Bareme,2,FALSE)))","v":""},null,null,{"$f":"IF(ISBLANK(O10),\"\",IF(ISERROR(VLOOKUP(O10,Bareme,2,FALSE)),\"N'appartient pas à la liste\",VLOOKUP(O10,Bareme,2,FALSE)))","v":""},null,{"$f":"IF(OR($K10<>\"\",$N10<>\"\",$Q10<>\"\"),SUM($K10,$N10,$Q10),\"\")","v":""},null,null,null,null,null,null,null,null,null,null,null,null,null,null,null,null,null,null,{"$f":"IsLabelOk($B10)","v":true},null,null,null,null,null,null,null,null,null,null,null,null,1]
["2","cartons","023400","","022","",6,"autre",30,"",240,null,"",null,null,"",null,"",null,null,null,null,null,null,null,null,null,null,null,null,null,null,null,null,null,null,true]
["3","cartons","023400","","022","",12,"autre",30,"",480,null,"",null,null,"",null,"",null,null,null,null,null,null,null,null,null,null,null,null,null,null,null,null,null,null,true]
["4","bouchons","023400","","B10","",1,"autre",60,"",5,null,"",null,null,"",null,"",null,null,null,null,null,null,null,null,null,null,null,null,null,null,null,null,null,null,true]
[null,null,null,"",null,"",null,null,null,"",null,null,"",null,null,"",null,"",null,null,null,null,null,null,null,null,null,null,null,null,null,null,null,null,null,null,true]
[null,null,null,"",null,"",null,null,null,"",null,null,"",null,null,"",null,"",null,null,null,null,null,null,null,null,null,null,null,null,null,null,null,null,null,null,true]
{"$rows_left_out":105}
{"sheet":"Nomenclature","index":4,"n_rows":397,"n_cols":42,"rows_kept":397,"cut":false,"hidden":false,"merged":[]}
[null,null,{"$f":"Titre_Sommaire","v":"Déclaration 2015"},null,null,null,{"$f":"Titre_Sommaire","v":"Déclaration 2015"},null,null,null,null,{"$f":"Titre_Sommaire","v":"Déclaration 2015"},null,"AVERTISSEMENT :  Les listes peuvent être complétées MAIS il ne faut pas NI laisser de ligne vide NI mettre une note/mémo sous les listes.",null,null,null,null,null,null,null,null,null,null,null,null,null,null,null,null,null,null,null,null,null,null,null,null,null,null,null,{"$f":"COLUMN()","v":42}]
[null,null,null,null,null,null,null,null,null,null,null,null,null,null,null,null,null,null,null,null,null,null,null,null,null,null,null,null,null,null,null,null,null,null,null,null,null,null,null,null,"Colonne active dans la déclaration = >",1]
[null,"n",28,null,null,null,13,null,null,12,15]
[null,"Sélectionnez votre nomenclature :",null,null,null,"Sélectionnez votre nomenclature :",null,null,null,"Sélectionnez votre nomenclature :",null,null,null,null,null,null,null,null,null,null,null,null,null,null,null,null,null,null,null,null,null,null,null,null,null,null,null,null,null,null,"Ligne active dans la déclaration = >",10]
[]
["Rechercher : "]
[]
["Code Produit","Désignation Produit",null,null,"Code Emballage","Désignation emballage",null,null,"Code Matériau","Matériau","Tarifs",null,null,"Bonus L2","Bonus L3",null,"ID emballage (bouteille)","Détection bouteille","Global",null,"ID emballage (bouchon)","Détection bouchons","Global",null,"Probleme bouteille sans bouchon",null,null,"Année","Bonus","Coef après bonus",null,"Année FDD","Coef bonus utilisé",null,"Colonne\nDéclaration\nCell Active","Ligne\nDéclaration\nCell Active",null,"Liste déroulante","Sélectionné",null,"Liste Pays","Codes pays"]
["010100","Biscottes et pains grillés",null,null,"001","Aérosol",null,null,10,"Acier",3.15,null,null,"On-Pack ITPV","Réduction de poids",null,"001",{"$f":"IF(COUNTIF(Declaration!$E:$E,Q9)-COUNTIF(Declaration!$E$4:$E$8,Q9)<>0,1,0)","v":0},{"$f":"SUM(R9:R30)","v":0},null,"B10",{"$f":"IF(COUNTIF(Declaration!$E:$E,U9)-COUNTIF(Declaration!$E$4:$E$8,U9)<>0,1,0)","v":0},{"$f":"SUM(V9:V14)","v":0},null,{"$f":"IF(AND(S9=1,W9=0),1,0)","v":0},null,null,2012,0.02,{"$f":"1-AC9","v":0.98},null,{"$f":"WWANNEE","v":2015},{"$f":"INDEX($AD$9:$AD$14,MATCH($AF$9,$AB$9:$AB$14,0))","v":0.92},null,25,1,null,"Produit",1,null,"ALLEMAGNE","DE"]
["010101","Produits similaires grillés",null,null,"102","Ailettes",null,null,20,"Aluminium",9.2799999999999994,null,null,"On-Pack personnalisé","Réduction de volume",null,"003",{"$f":"IF(COUNTIF(Declaration!$E:$E,Q10)-COUNTIF(Declaration!$E$4:$E$8,Q10)<>0,1,0)","v":0},null,null,"B11",{"$f":"IF(COUNTIF(Declaration!$E:$E,U10)-COUNTIF(Declaration!$E$4:$E$8,U10)<>0,1,0)","v":0},null,null,null,null,null,{"$f":"AB9+1","v":2013},0.02,{"$f":"1-AC10","v":0.98},null,null,null,null,null,null,null,"Emballage",null,null,"AUTRICHE","AT"]
["010201","Biscuits et snacks salés",null,null,"002","Ampoule",null,null,30,"Papier-carton - Autre que briques",16.329999999999998,null,null,"In-Pack ITPV","Recharge",null,"004",{"$f":"IF(COUNTIF(Declaration!$E:$E,Q11)-COUNTIF(Declaration!$E$4:$E$8,Q11)<>0,1,0)","v":0},null,null,"B14",{"$f":"IF(COUNTIF(Declaration!$E:$E,U11)-COUNTIF(Declaration!$E$4:$E$8,U11)<>0,1,0)","v":0},null,null,null,null,null,{"$f":"AB10+1","v":2014},0.08,{"$f":"1-AC11","v":0.92},null,null,null,null,null,null,null,"Matériau",null,null,"BELGIQUE","BE"]
["010202","Biscuits sucrés",null,null,"003","Baril, carrier pack",null,null,31,"Papier-carton - Briques",17.04,null,null,"In-Pack personnalisé",null,null,"005",{"$f":"IF(COUNTIF(Declaration!$E:$E,Q12)-COUNTIF(Declaration!$E$4:$E$8,Q12)<>0,1,0)","v":0},null,null,"B17",{"$f":"IF(COUNTIF(Declaration!$E:$E,U12)-COUNTIF(Declaration!$E$4:$E$8,U12)<>0,1,0)","v":0},null,null,null,null,null,2015,0.08,0.92,null,null,null,null,null,null,null,null,null,null,"CANADA","CA"]
["010203","Pains d’épices, pâtisseries, viennoiseries de conservation",null,null,"004","Barquette",null,null,45,"Plastique - Bouteilles et flacons en PET clair ",24.22,null,null,"Notice ITPV",null,null,"006",{"$f":"IF(COUNTIF(Declaration!$E:$E,Q13)-COUNTIF(Declaration!$E$4:$E$8,Q13)<>0,1,0)","v":0},null,null,"B18",{"$f":"IF(COUNTIF(Declaration!$E:$E,U13)-COUNTIF(Declaration!$E$4:$E$8,U13)<>0,1,0)","v":0},null,null,null,null,null,null,null,null,null,null,null,null,null,null,null,null,null,null,"CHINE","CN"]
["010301","Café, chicorée, malt en grain",null,null,"005","Barquette préformée",null,null,44,"Plastique - Autres bouteilles et flacons ",24.47,null,null,"Notice personnalisée",null,null,"008",{"$f":"IF(COUNTIF(Declaration!$E:$E,Q14)-COUNTIF(Declaration!$E$4:$E$8,Q14)<>0,1,0)","v":0},null,null,"B19",{"$f":"IF(COUNTIF(Declaration!$E:$E,U14)-COUNTIF(Declaration!$E$4:$E$8,U14)<>0,1,0)","v":0},null,null,null,null,null,null,null,null,null,null,null,null,null,null,null,null,null,null,"ESPAGNE","ES"]
["010302","Café, chicorée, malt moulus",null,null,"006","Bidon",null,null,43,"Plastique - Autres emballages plastique",28.06,null,null,"Off-Pack",null,null,"009",{"$f":"IF(COUNTIF(Declaration!$E:$E,Q15)-COUNTIF(Declaration!$E$4:$E$8,Q15)<>0,1,0)","v":0},null,null,null,null,null,null,null,null,null,null,null,null,null,null,null,null,null,null,null,null,null,null,"FINLANDE","FI"]
{"$rows_left_out":383}
{"sheet":"Exemples","index":5,"n_rows":98,"n_cols":34,"rows_kept":98,"cut":false,"hidden":false,"merged":[[20,2,20,11]]}
[null,null,null,null,null,null,null,null,null,null,null,null,{"$f":"Titre_Sommaire","v":"Déclaration 2015"},null,null,null,null,null,null,null,null,null,null,null,null,null,null,null,null,null,null,null,null,{"$f":"COLUMN()","v":34}]
[]
[]
["Exemples au tarif 2015"]
[]
[null,"Liens directs :"]
[null,null,{"$f":"HYPERLINK(MID(CELL(\"filename\",$A$11),FIND(\"[\",CELL(\"filename\",$A$11)),FIND(\"]\",CELL(\"filename\",$A$11))-FIND(\"[\",CELL(\"filename\",$A$11))+1)\n&\"'\"\n&MID(CELL(\"filename\",$A$11),FIND(\"]\",CELL(\"filename\",$A$11))+1,LEN(CELL(\"filename\",$A$11))-FIND(\"]\",CELL(\"filename\",$A$11)))\n&\"'!\"&CELL(\"adresse\",$A$11),$B$11)","v":"1 - Cas de la chaîne HIFI"}]
[null,null,{"$f":"HYPERLINK(MID(CELL(\"filename\",$A$91),FIND(\"[\",CELL(\"filename\",$A$91)),FIND(\"]\",CELL(\"filename\",$A$91))-FIND(\"[\",CELL(\"filename\",$A$91))+1)\n&\"'\"\n&MID(CELL(\"filename\",$A$91),FIND(\"]\",CELL(\"filename\",$A$91))+1,LEN(CELL(\"filename\",$A$91))-FIND(\"]\",CELL(\"filename\",$A$91)))\n&\"'!\"&CELL(\"adresse\",$A$91),$B$62)","v":"2 - Cas du pack de bières"}]
[]
[]
[null,"1 - Cas de la chaîne HIFI"]
[]
[]
[null,null,"A - Caisse en papier carton recyclé :",null,null,null,null,null,null,null,{"$f":"HYPERLINK(MID(CELL(\"filename\",A5),FIND(\"[\",CELL(\"filename\",A5)),FIND(\"]\",CELL(\"filename\",A5))-FIND(\"[\",CELL(\"filename\",A5))+1)\n&\"'\"\n&MID(CELL(\"filename\",A5),FIND(\"]\",CELL(\"filename\",A5))+1,LEN(CELL(\"filename\",A5))-FIND(\"]\",CELL(\"filename\",A5)))\n&\"'!\"&CELL(\"adresse\",A5),\"Remonter en haut\")","v":"Remonter en haut"}]
[]
{"$rows_left_out":84}
{"sheet":"Specs","index":6,"n_rows":257,"n_cols":25,"rows_kept":257,"cut":false,"hidden":true,"merged":[[0,0,0,7],[0,10,0,17]]}
["Alphabet \"alphanumérique\"",null,null,null,null,null,null,null,null,null,"Alphabet \"alphanumérique restreint\"",null,null,null,null,null,null,null,null,null,null,null,null,"15-01-2016 09:45","v2015-12-16"]
["Numéro ASCII","Caractère","Autorisation","Compteur",null,{"$f":"COUNTIF(G$3:G$257,\"<>-\")","v":189},"Liste numéros ASCII autorisés","Liste caractères autorisés",null,null,"Numéro ASCII","Caractère","Autorisation","Compteur",null,{"$f":"COUNTIF(Q$3:Q$257,\"<>-\")","v":70},"Liste numéros ASCII autorisés","Liste caractères autorisés"]
[1,{"$f":"CHAR(A3)","v":"\u0001"},0,{"$f":"IF(C3=1,SUM(C$3:C3),\"\")","v":""},null,1,{"$f":"IF(ISERROR(MATCH(F3,D$3:D$257,0)),\"-\",INDEX(A$3:A$257,MATCH(F3,D$3:D$257,0)))","v":32},{"$f":"IF(G3<>\"-\",CHAR(G3),\"\")","v":" "},null,null,1,{"$f":"CHAR(K3)","v":"\u0001"},1,{"$f":"IF(M3=1,SUM(M$3:M3),\"\")","v":1},null,1,{"$f":"IF(ISERROR(MATCH(P3,N$3:N$257,0)),\"-\",INDEX(K$3:K$257,MATCH(P3,N$3:N$257,0)))","v":1},{"$f":"IF(Q3<>\"-\",CHAR(Q3),\"\")","v":"\u0001"}]
[{"$f":"A3+1","v":2},{"$f":"CHAR(A4)","v":"\u0002"},0,{"$f":"IF(C4=1,SUM(C$3:C4),\"\")","v":""},null,{"$f":"F3+1","v":2},33,"!",null,null,{"$f":"K3+1","v":2},{"$f":"CHAR(K4)","v":"\u0002"},0,{"$f":"IF(M4=1,SUM(M$3:M4),\"\")","v":""},null,{"$f":"P3+1","v":2},9,"\t"]
[{"$f":"A4+1","v":3},"\u0003",0,{"$f":"IF(C5=1,SUM(C$3:C5),\"\")","v":""},null,{"$f":"F4+1","v":3},34,"\"",null,null,{"$f":"K4+1","v":3},"\u0003",0,{"$f":"IF(M5=1,SUM(M$3:M5),\"\")","v":""},null,{"$f":"P4+1","v":3},28,"\u001c"]
[4,"\u0004",0,{"$f":"IF(C6=1,SUM(C$3:C6),\"\")","v":""},null,4,35,"#",null,null,4,"\u0004",0,{"$f":"IF(M6=1,SUM(M$3:M6),\"\")","v":""},null,4,29,"\u001d"]
[5,{"$f":"CHAR(A7)","v":"\u0005"},0,{"$f":"IF(C7=1,SUM(C$3:C7),\"\")","v":""},null,5,36,"$",null,null,5,"\u0005",0,{"$f":"IF(M7=1,SUM(M$3:M7),\"\")","v":""},null,5,30,"\u001e"]
[6,"\u0006",0,{"$f":"IF(C8=1,SUM(C$3:C8),\"\")","v":""},null,6,37,"%",null,null,6,"\u0006",0,{"$f":"IF(M8=1,SUM(M$3:M8),\"\")","v":""},null,6,31,"\u001f"]
[7,"\u0007",0,{"$f":"IF(C9=1,SUM(C$3:C9),\"\")","v":""},null,7,38,"&",null,null,7,"\u0007",0,{"$f":"IF(M9=1,SUM(M$3:M9),\"\")","v":""},null,7,32," "]
[8,"\b",0,{"$f":"IF(C10=1,SUM(C$3:C10),\"\")","v":""},null,8,39,"'",null,null,8,"\b",0,{"$f":"IF(M10=1,SUM(M$3:M10),\"\")","v":""},null,8,48,"0"]
[9,{"$f":"CHAR(A11)","v":"\t"},0,{"$f":"IF(C11=1,SUM(C$3:C11),\"\")","v":""},null,9,40,"(",null,null,9,"\t",1,{"$f":"IF(M11=1,SUM(M$3:M11),\"\")","v":2},null,9,49,"1"]
[10,"\n",0,{"$f":"IF(C12=1,SUM(C$3:C12),\"\")","v":""},null,10,41,")",null,null,10,"\n",0,{"$f":"IF(M12=1,SUM(M$3:M12),\"\")","v":""},null,10,50,"2"]
[11,"\u000b",0,{"$f":"IF(C13=1,SUM(C$3:C13),\"\")","v":""},null,11,42,"*","\u000b",null,11,"\u000b",0,{"$f":"IF(M13=1,SUM(M$3:M13),\"\")","v":""},null,11,51,"3"]
[12,"\f",0,{"$f":"IF(C14=1,SUM(C$3:C14),\"\")","v":""},null,12,43,"+",null,null,12,"\f",0,{"$f":"IF(M14=1,SUM(M$3:M14),\"\")","v":""},null,12,52,"4"]
[13,"\r",0,{"$f":"IF(C15=1,SUM(C$3:C15),\"\")","v":""},null,13,44,",",null,null,13,"\r",0,{"$f":"IF(M15=1,SUM(M$3:M15),\"\")","v":""},null,13,53,"5"]
{"$rows_left_out":242}